#3 Will not compile

open
nobody
None
5
2003-12-02
2003-12-02
Anonymous
No

Hi, i just got brickOS and i am trying to get it
installed. I got the hp8300 complier and got that
installed fine. When i do make i get the following error:
make[1]: Entering directory `/home/dmann/brickos/lib'
make[2]: Entering directory `/home/dmann/brickos/lib/c'
/usr/local/bin/h8300-hms-gcc -O2 -fno-builtin
-fomit-frame-pointer -Wall
-I/home/dmann/brickos/include
-I/home/dmann/brickos/include/lnp -I. -c memcpy.c -o
memcpy.o
memcpy.c:48:9: missing terminating " character
memcpy.c:56:9: missing terminating " character
memcpy.c:58:9: missing terminating " character
memcpy.c: In function `memcpy':
memcpy.c:59: error: parse error before numeric constant
memcpy.c:60:16: invalid suffix "f" on integer constant
memcpy.c:61: error: syntax error at '@' token
memcpy.c:62: error: syntax error at '@' token
memcpy.c:63: error: syntax error at '#' token
memcpy.c:64:16: invalid suffix "b" on integer constant
memcpy.c:66:9: missing terminating " character
memcpy.c:44: warning: unused variable `end'
memcpy.c:45: warning: unused variable `dummy'
make[2]: *** [memcpy.o] Error 1
make[2]: Leaving directory `/home/dmann/brickos/lib/c'
make[1]: *** [all] Error 2
make[1]: Leaving directory `/home/dmann/brickos/lib'
make: *** [all] Error 2

This is the latest release of brickOS.
Any idea what i need to do to fix this?
Thanks!

Discussion