Learn how easy it is to sync an existing GitHub or Google Code repo to a SourceForge project! See Demo

Close

#150 5491: seconds.h

closed-fixed
nobody
Code (71)
5
2012-09-09
2012-09-09
Victor Ivrii
No

I successfully compiled asy 5491 on MacOSX 10.8.1 but not on 10.7.4

It complains that seconds.h referred from fftw++.h is not found. Really there are no seconds.h anywhere

Discussion

  • Victor Ivrii
    Victor Ivrii
    2012-09-09

    Ditto for the next version 5492:

    In file included from runarray.in:29:
    fftw++.h:56:21: error: seconds.h: No such file or directory
    In file included from runarray.in:29:
    fftw++.h: In member function ‘void fftwpp::fftw::Setup(Complex*, Complex*)’:
    fftw++.h:360: error: ‘seconds’ was not declared in this scope
    fftw++.h:381: error: ‘seconds’ was not declared in this scope
    make: *** [runarray.o] Error 1

     
  • John Bowman
    John Bowman
    2012-09-09

    Thanks; fixed in svn and upcoming release.

     
  • John Bowman
    John Bowman
    2012-09-09

    • status: open --> closed-fixed