#8 Aften fails to build under ppc/osx

open
nobody
None
5
2009-06-07
2009-06-07
Anonymous
No

Scanning dependencies of target aften_pcm
[ 4%] Building C object CMakeFiles/aften_pcm.dir/pcm/byteio.o
[ 8%] Building C object CMakeFiles/aften_pcm.dir/pcm/convert.o
[ 13%] Building C object CMakeFiles/aften_pcm.dir/pcm/pcm.o
[ 17%] Building C object CMakeFiles/aften_pcm.dir/pcm/raw.o
[ 21%] Building C object CMakeFiles/aften_pcm.dir/pcm/wav.o
Linking C static library libaften_pcm.a
[ 21%] Built target aften_pcm
[ 26%] Building C object CMakeFiles/aften_static.dir/libaften/ppc/ppc_cpu_caps.o
In file included from /Users/srv_adm/aften-0.0.8/libaften/cpu_caps.h:26,
from /Users/srv_adm/aften-0.0.8/libaften/ppc/ppc_cpu_caps.c:21:
/Users/srv_adm/aften-0.0.8/libaften/ppc/ppc_cpu_caps.h:29: error: syntax error before '*' token
/Users/srv_adm/aften-0.0.8/libaften/ppc/ppc_cpu_caps.c:95: error: syntax error before '*' token
/Users/srv_adm/aften-0.0.8/libaften/ppc/ppc_cpu_caps.c: In function 'apply_simd_restrictions':
/Users/srv_adm/aften-0.0.8/libaften/ppc/ppc_cpu_caps.c:97: error: 'simd_instructions' undeclared (first use in this function)
/Users/srv_adm/aften-0.0.8/libaften/ppc/ppc_cpu_caps.c:97: error: (Each undeclared identifier is reported only once
/Users/srv_adm/aften-0.0.8/libaften/ppc/ppc_cpu_caps.c:97: error: for each function it appears in.)
make[2]: *** [CMakeFiles/aften_static.dir/libaften/ppc/ppc_cpu_caps.o] Error 1
make[1]: *** [CMakeFiles/aften_static.dir/all] Error 2
make: *** [all] Error 2

Discussion